USCIS Administrative Appeals Office
type: Class
alternative label: 美国公民及移民服务局行政上诉办公室
subclass of: R727b64EAD112DC2c3c2D915
subclass of: RnSHqIE6kW486gQwcgL03v
definition: The USCIS Administrative Appeals Office is a specific administrative venue within the U.S. Citizenship and Immigration Services where individuals can appeal certain immigration-related decisions made by USCIS.