Plea Agreement
type: Class
alternative label: 认罪协议
subclass of: RfNcSczOsxXooaI8T73bOX
definition: A plea agreement is a legal document that outlines an agreement between a defendant and prosecutor, in which the defendant agrees to plead guilty or no contest to a charge in exchange for a reduced sentence or other concessions.