Indiana Town Court - Marion County, Washington Twp.
type: Class
subclass of: RBB5cexM3974afJhhR2yXHA
definition: A local court in Marion County, Washington Township, Indiana that handles minor criminal and traffic offenses, as well as small claims and civil cases within its jurisdiction.