New York Court of Appeals
type: Class
subclass of: R3391bdB1A2adE51071C7cf7
definition: The New York Court of Appeals is the highest court in the New York State court system, responsible for hearing appeals from lower courts and making final decisions on legal disputes.