Payee Name - Fee or Expense
type: Class
alternative label: 收款人姓名 - 费用或支出
subclass of: RMDZKh0zTn6FdXzpYpbsle
definition: Payee Name - Fee or Expense refers to the specific details of the payment recipient and the type of payment, whether it is a fee or an expense, within the context of an engagement for legal services.