Galibi Carib
type: Class
alternative label: 加利比-卡里布
subclass of: RDOvAHsvY8TKJ1O1orXPM9o
definition: Galibi Carib is a language that belongs to the Cariban language family and is spoken by the Galibi people in parts of South America.