Including Without Limitation Clause
type: Class
alternative label: 包括无限制条款
subclass of: RDe0RKU39BlhcyACJW30ZLc
definition: An "Including Without Limitation Clause" is a provision in a contract that clarifies that the listed items are not an exhaustive list and that other items may also be included.