Missouri Circuit Court - Gasconade County
type: Class
subclass of: RDECjssxw76vdlahxiUTb4L
definition: A Missouri Circuit Court located in Gasconade County, which is responsible for hearing and deciding civil and criminal cases within its jurisdiction.