Motion for Interest on a Judgment
type: Class
alternative label: 判决利息动议
subclass of: RRqkEecrvjlGLXMzh1FGa1
definition: A Motion for Interest on a Judgment is a request made to the court to add interest to a previously awarded judgment, typically to compensate for the delay in payment.