tax_tier_max
type: Class
subclass of: RBPwovGZw8ygaPhghSc1oMI
definition: "The maximum amount of this tax tier expressed in INVOICE.inv_currency. Use the value ""TOP"" to indicate that the top tier extends to infinity. "