Governor
type: Class
subclass of: RBZXbv75cyMrROEWybfqeTJ
definition: A Governor is the chief executive officer of a state, commonwealth, or territory within a federal system of government. This official is typically elected by the populace and is responsible for implementing state laws, managing the state government, and serving as the state's top representative in dealings with other states and the federal government.