Citations to Another Document
type: Class
alternative label: 对另一份文件的引用
subclass of: RDmbgHQXJxEvx3QYfR6qWAn
definition: A document's citations to other documents (e.g., legal authorities, exhibits, other documents).