Dispositive Motions
type: Class
alternative label: 裁定动议
subclass of: R8zwKGkogGKIKWSVWb1ItRL
definition: Dispositive Motions are requests made by a party in a trial court seeking a final resolution of a case or a particular issue, such as a motion for summary judgment or a motion to dismiss.