A116 Training
type: Class
subclass of: RnTEPb LCSNqAkQqrfte8zg
definition: Training services provided by the law firm or legal vendor and billed as an hourly service. Typically technical or project training associated with eDiscovery.