No Assignment Clause
type: Class
alternative label: 无转让条款
subclass of: RDe0RKU39BlhcyACJW30ZLc
definition: A No Assignment Clause is a provision in a contract that prohibits one party from transferring their rights or obligations under the contract to a third party without the consent of the other party.