ADR Court-Annexed Arbitration Forum
type: Class
subclass of: RC8gGTL4dazXLDWuElLZLjI
definition: An ADR Court-Annexed Arbitration Forum is a type of Alternative Dispute Resolution (ADR) Forum that is attached to a court and provides a process for resolving disputes outside of the traditional court system.