Matter ID
type: Class
preferred label: Matter Identifier
alternative label: 事项编号
subclass of: R8EoZh39tWmXCkmP2Xzjl6E
subclass of: R9CZTlyeU1hg4NPl7hcDKI2
definition: Matter ID refers to a unique identifier assigned to a specific legal matter within an engagement for providing legal services. That matter identifier (e.g., IRIs, UUIDs, GUIDs) can be created and stored within the systems of various stakeholders (e.g., vendors, sellers, buyers, courts, regulators).