PA330 Design Application Preparation - Domestic
type: Class
subclass of: RjPfJalsXTL-aarnLtmpQzw
definition: All actions associated with completing a design patent (but not utility or utility model) application or design registration application that are to be filed in the ("domestic") home country or region of the applicant, including review of invention disclosure materials and prior art, interviews with the inventors, drafting and revision of application, preparation and execution of formal documents (such as assignments, declarations, information disclosure statements, and transmittals) filing of application, and reporting to the client. Note that government fees and external drafting expenses (or "disbursements" in the U.S.) are included under E100.