Indiana Circuit Court - White County
type: Class
subclass of: RCeiXNGpqL4H3jo1g1NobSm
definition: Indiana Circuit Court - White County: A court of general jurisdiction in the state of Indiana that has the authority to hear and decide civil and criminal cases within White County.