Misdemeanor Manslaughter
type: Class
alternative label: 过失杀人
subclass of: R9pC5rYhFMiLaQiSZETyftd
definition: Misdemeanor Manslaughter is a type of negligent manslaughter that occurs when a person commits a misdemeanor offense that results in the death of another person.