PA710 Opinion Preparation
type: Class
subclass of: R4OSB4wBIRgipGEh-XVXSZA
definition: All action associated with the completing formal legal opinions on the validity, enforceability, infringement, and/or non-infringement of a patent claim. Includes opinions on infringement of a client's patent by a non-client infringer.