Marathi
type: Class
alternative label: 马拉地语
subclass of: RDOvAHsvY8TKJ1O1orXPM9o
definition: Marathi is a structured system of communication, consisting of grammar and vocabulary, used in legal matters, which is a subcategory of the Language class.