Copyright Assets
type: Class
alternative label: 版权资产
subclass of: RBUBqjNCYBI4CtLUcdAVYwy
definition: Copyright assets are a type of intellectual property asset that refers to the exclusive legal right to use and distribute original works of authorship, such as books, music, and software.