Debt Agreement
type: Class
preferred label: Debt Related Agreement
alternative label: 债务协议
subclass of: R88D8i8AcSTUig2X3yPbFHg
subclass of: RlOK1srhoah3VuQIedr0aS
definition: A Debt Agreement is a legally binding contract between a debtor and creditor(s) that outlines the terms and conditions for repayment of a debt, including any interest or fees.