Intervening Event - Known at Signing
type: Class
alternative label: 介入事件 - 签署时已知
subclass of: R7YcudBFwMUS1r7BcWje7Ly
definition: An Intervening Event - Known at Signing is a specific type of event that occurs after the signing of a legal agreement and has been anticipated by the parties involved.