Collaboration Platform Management
type: Class
subclass of: RCwxbPXNA8weZDagHlCea
definition: Collaboration Platform Management refers to the management of a system or software that enables individuals or groups to work together on a project or task, including the coordination of communication, data sharing, and workflow.