Motion to Stay Proceedings Pending Appeal
type: Class
alternative label: 暂停诉讼程序等待上诉
subclass of: R8r0fE60KG2VwRq1OwbjEUY
definition: A Motion to Stay Proceedings Pending Appeal is a request made to a court to pause legal proceedings until an appeal is resolved.