PA560 Validation Patent Application Preparation - International
type: Class
subclass of: RAyPCiRnrSpqlHX60SeZrLA
definition: All actions associated with the preparation and filing of applications for validation of an issued regional patent outside of the ('domestic') home country of the applicant. Note that PCT National Phase Entry is a continuing application process included under PA350 or PA550.