Key Employee Incentive Program Motion
type: Class
alternative label: 关键员工激励计划动议
subclass of: R7QiKeEkci1FYlRMv6nDRnv
definition: A Key Employee Incentive Program Motion (KEIP) is a request made in a bankruptcy case to provide incentives to key employees to remain with the company during the bankruptcy process.