Threatened Battery Assault
type: Class
preferred label: Threatened Violence
alternative label: 威胁性电池袭击
subclass of: R8BLgPtZOuKFI8MtZNTaT0u
definition: The concept of Threatened Battery Assault refers to a criminal assault where the perpetrator intentionally causes the victim to fear immediate bodily harm or offensive contact, without actually making physical contact.