Common Carrier Liability
type: Class
alternative label: 普通承运人责任
subclass of: RCfunX4u69LUQ3gbhckE0oI
subclass of: RDSBerlLWg1ntpLqDQn1eVn
definition: Common Carrier Liability refers to the legal responsibility of transportation companies, such as railroads, trucking companies, and cruise ships, to ensure the safety of their passengers and cargo while in transit.