PA540 Plant Patent Preparation - International
type: Class
subclass of: RAyPCiRnrSpqlHX60SeZrLA
definition: All actions associated with completing plant patent applications that are to be filed outside the ('domestic') home country or region of the applicant, including translations, review of any invention disclosure materials or parent applications, drafting of application including pre-filing revision of parent applications, preparation and execution of formal documents (such as assignments, declarations, information disclosure statements, transmittals, and biological deposits) filing of application, and reporting to the client Note that government fees and other external expenses are included under E100.