Disclosure Letter Clause
type: Class
alternative label: डिस्क्लोजर लेटर क्लॉज
subclass of: RDe0RKU39BlhcyACJW30ZLc
definition: A Disclosure Letter Clause is a specific type of contractual clause that requires one party to provide the other party with a letter disclosing certain information related to the contract.