Waiver of Service of Summons
type: Class
alternative label: 放弃传票送达
subclass of: R7zvYKadqTXgMZV8ghLsloR
definition: A waiver of service of summons is a legal document that allows a defendant to waive their right to be formally served with a summons and complaint, thereby expediting the legal process.