L619 Quality assurance and control
type: Class
subclass of: RKcU29Hc3QmmKCxPZ6oPpcQ
definition: Activities and actions related to ensuring that the process and practices used to perform analysis meet an acceptable level of defensibility.