A127 Project Management
type: Class
subclass of: RnTEPb LCSNqAkQqrfte8zg
definition: Discovery or eDiscovery project management services, including budgeting and case assessment of the project and quality assurance and control. Excludes legal project management of a matter.