Arbitration Practice
type: Class
alternative label: 仲裁实践
subclass of: R85H4hDZWq92xwwBFP7WCtM
hidden label: ARB
definition: Arbitration, a form of alternative dispute resolution (ADR), is a way to resolve disputes outside the courts. The dispute will be decided by one or more persons (the "arbitrators", "arbiters" or "arbitral tribunal"), which renders the "arbitration award".