Approval Signatures Clause
type: Class
alternative label: 批准签名条款
subclass of: RDe0RKU39BlhcyACJW30ZLc
definition: An Approval Signatures Clause is a provision in a contract that requires the parties to sign and approve the agreement in order for it to be legally binding.