New York District Court - Nassau County - 3rd District
type: Class
subclass of: R7aBbOhIQLuwrLOympuadoq
definition: New York District Court - Nassau County (3d Dist.) is a specific court within the New York District Court system, located in Nassau County and designated as the third district.