X301 Discovery/eDiscovery Collection-Third Party
type: Class
subclass of: R325XgE86TFi0q8WvxwrJ4w
definition: Any costs associated with the retrieval of collection materials from a third party when billed as an expense instead of a service