Removal of Personal Property Clause
type: Class
alternative label: 个人财产清除条款
subclass of: RDe0RKU39BlhcyACJW30ZLc
definition: A Removal of Personal Property Clause is a provision in a contract that allows one party to take possession of another party's personal property in certain circumstances.