Upon Death Clause
type: Class
alternative label: 死亡条款
subclass of: RDe0RKU39BlhcyACJW30ZLc
definition: An "Upon Death Clause" is a provision in a contract that specifies what will happen to the contract or its subject matter upon the death of one of the parties involved.