Indian Child Welfare Act Claim
type: Class
alternative label: 印第安儿童福利法索赔
subclass of: R1XGKMfgmQGI3yTSEndqMN
definition: A claim made under the Indian Child Welfare Act (ICWA), which provides specific protections for Native American children in custody and visitation cases.