Ownership Clause
type: Class
alternative label: 所有权条款
subclass of: RDe0RKU39BlhcyACJW30ZLc
definition: An Ownership Clause is a provision in a contract that specifies who has the legal right to own and control a particular work product or information.