Critical Care Malpractice
type: Class
alternative label: 重症监护医疗事故责任
subclass of: R8nVhrBlasGIc7jxw1D0vbm
definition: Negligence or wrongdoing by a medical professional or facility in the treatment of a critically ill patient, resulting in harm or injury.