Forcible Entry and Detainer
type: Class
alternative label: 非法侵入和驱逐
subclass of: R89e7t0wDXgx7mBu9rn271g
subclass of: RDSBerlLWg1ntpLqDQn1eVn
subclass of: RDqSn32zsjxExcBFzIYxT2D
definition: The concept of Forcible Entry and Detainer refers to the illegal act of entering and taking possession of someone else's property without their consent, and the legal actions that can be taken to remove the trespasser and regain possession of the property.