Liability Clause
type: Class
alternative label: 责任条款
subclass of: RDe0RKU39BlhcyACJW30ZLc
definition: A Liability Clause is a provision in a contract that outlines the responsibility of one party to compensate the other party for any losses or damages incurred as a result of a breach of the contract.