Right to Sublet Clause
type: Class
alternative label: 转租权条款
subclass of: RDe0RKU39BlhcyACJW30ZLc
definition: The Right to Sublet Clause is a provision in a contract that grants the tenant the legal right to sublet the property to another person for a specified period of time.