WC350 Discovery Motions
type: Class
subclass of: Rtk9 RnfyT9yacC QKTzn8Q
definition: Preparing/responding to/arguing motions that arise from discovery, Review order ruling on motion, Preparing summary of tribunal order