X123 Publication Costs
type: Class
subclass of: RtpnOBk4lRnWigpEBBKYUDQ
definition: Any fees associated with publishing an official notice on the matter as required by statute. Excludes electronic or bound resource material purchased for use as a reference (X124) or legal research service costs (X111).